{"text_format":"1","workbook":"xlsx","n_sheets":5,"sheets":["Introduction","Sheet2","Study","Fruits","System"],"not_rendered":{"charts":0,"images":0,"macros":1,"external_links":0,"defined_names":2,"comments":0,"pivot_tables":0},"unopened":[],"bounds":{"document_bytes":16777216,"sheet_cells":100000,"rows_first":2000,"rows_last":500,"rows_between":2000,"halvings":0,"cell_chars":16384,"cell_head_chars":4096},"cells_cut":0,"cells_raw":0,"read":"whole","date_system":"1900"}

{"sheet":"Introduction","index":0,"n_rows":21,"n_cols":6,"rows_kept":21,"cut":false,"hidden":false,"merged":[[2,1,18,9]]}
[null,null,null,null,null,"www.Tricks12345.com"]
[]
[null,"Vlookup \nTable Array from \nDifferent Sources"]
[]
[]
[]
[]
[]
[]
[]
[]
[]
[]
[]
[]
[]
[]
[]
[]
[]
[null,"Pavan Kumar Gundlapalli"]

{"sheet":"Sheet2","index":1,"n_rows":13,"n_cols":14,"rows_kept":13,"cut":false,"hidden":false,"merged":[]}
["Item","Price",null,null,null,"Item","Price",null,"Item","Price",null,null,"Item","Price"]
["Apple",{"$f":"IFERROR(VLOOKUP(A2,Fruits!$A$2:$B$6,2,0),IFERROR(VLOOKUP(A2,Study!$A$2:$B$5,2,0), IFERROR(VLOOKUP(A2,System!$A$2:$B$3,2,0), \"Doesn't Exists\")))","v":10},null,null,null,"KeyBoard",1111,null,"Apple",10,null,null,"Pen",111]
["KeyBoard",{"$f":"IFERROR(VLOOKUP(A3,Fruits!$A$2:$B$6,2,0),IFERROR(VLOOKUP(A3,Study!$A$2:$B$5,2,0), IFERROR(VLOOKUP(A3,System!$A$2:$B$3,2,0), \"Doesn't Exists\")))","v":1111},null,null,null,"Mouse",1112,null,"Banana",11,null,null,"Pencil",112]
["Orange",{"$f":"IFERROR(VLOOKUP(A4,Fruits!$A$2:$B$6,2,0),IFERROR(VLOOKUP(A4,Study!$A$2:$B$5,2,0), IFERROR(VLOOKUP(A4,System!$A$2:$B$3,2,0), \"Doesn't Exists\")))","v":12},null,null,null,null,null,null,"Orange",12,null,null,"Eraser",113]
["Mango",{"$f":"IFERROR(VLOOKUP(A5,Fruits!$A$2:$B$6,2,0),IFERROR(VLOOKUP(A5,Study!$A$2:$B$5,2,0), IFERROR(VLOOKUP(A5,System!$A$2:$B$3,2,0), \"Doesn't Exists\")))","v":"Doesn't Exists"},null,null,null,null,null,null,"Grapes",13,null,null,"Duster",114]
["Grapes",{"$f":"IFERROR(VLOOKUP(A6,Fruits!$A$2:$B$6,2,0),IFERROR(VLOOKUP(A6,Study!$A$2:$B$5,2,0), IFERROR(VLOOKUP(A6,System!$A$2:$B$3,2,0), \"Doesn't Exists\")))","v":13},null,null,null,null,null,null,"PineApple",14]
["PineApple",{"$f":"IFERROR(VLOOKUP(A7,Fruits!$A$2:$B$6,2,0),IFERROR(VLOOKUP(A7,Study!$A$2:$B$5,2,0), IFERROR(VLOOKUP(A7,System!$A$2:$B$3,2,0), \"Doesn't Exists\")))","v":14}]
["CPU",{"$f":"IFERROR(VLOOKUP(A8,Fruits!$A$2:$B$6,2,0),IFERROR(VLOOKUP(A8,Study!$A$2:$B$5,2,0), IFERROR(VLOOKUP(A8,System!$A$2:$B$3,2,0), \"Doesn't Exists\")))","v":"Doesn't Exists"}]
["Bench",{"$f":"IFERROR(VLOOKUP(A9,Fruits!$A$2:$B$6,2,0),IFERROR(VLOOKUP(A9,Study!$A$2:$B$5,2,0), IFERROR(VLOOKUP(A9,System!$A$2:$B$3,2,0), \"Doesn't Exists\")))","v":"Doesn't Exists"}]
["Pencil",{"$f":"IFERROR(VLOOKUP(A10,Fruits!$A$2:$B$6,2,0),IFERROR(VLOOKUP(A10,Study!$A$2:$B$5,2,0), IFERROR(VLOOKUP(A10,System!$A$2:$B$3,2,0), \"Doesn't Exists\")))","v":112},null,null,null,null,null,null,null,null,null,null," "]
["Eraser",{"$f":"IFERROR(VLOOKUP(A11,Fruits!$A$2:$B$6,2,0),IFERROR(VLOOKUP(A11,Study!$A$2:$B$5,2,0), IFERROR(VLOOKUP(A11,System!$A$2:$B$3,2,0), \"Doesn't Exists\")))","v":113}]
["Table",{"$f":"IFERROR(VLOOKUP(A12,Fruits!$A$2:$B$6,2,0),IFERROR(VLOOKUP(A12,Study!$A$2:$B$5,2,0), IFERROR(VLOOKUP(A12,System!$A$2:$B$3,2,0), \"Doesn't Exists\")))","v":"Doesn't Exists"}]
["Duster",{"$f":"IFERROR(VLOOKUP(A13,Fruits!$A$2:$B$6,2,0),IFERROR(VLOOKUP(A13,Study!$A$2:$B$5,2,0), IFERROR(VLOOKUP(A13,System!$A$2:$B$3,2,0), \"Doesn't Exists\")))","v":114}]

{"sheet":"Study","index":2,"n_rows":5,"n_cols":2,"rows_kept":5,"cut":false,"hidden":false,"merged":[]}
["Item","Price"]
["Pen",111]
["Pencil",112]
["Eraser",113]
["Duster",114]

{"sheet":"Fruits","index":3,"n_rows":6,"n_cols":2,"rows_kept":6,"cut":false,"hidden":false,"merged":[]}
["Item","Price"]
["Apple",10]
["Banana",11]
["Orange",12]
["Grapes",13]
["PineApple",14]

{"sheet":"System","index":4,"n_rows":3,"n_cols":2,"rows_kept":3,"cut":false,"hidden":false,"merged":[]}
["Item","Price"]
["KeyBoard",1111]
["Mouse",1112]